{"text_format":"1","workbook":"xlsx","n_sheets":16,"sheets":["SVERWEIS","Einführung","WENN-Beispiel","WENN-Lösung","Personen","sogehts","Urlaubsantrag","Datenbank","Tabelle1","Artikel","Abfrage","SVERWEIS TRUE","IHK Notenschlüssel","Chefliste","Liste Feiertage","Makros"],"not_rendered":{"charts":0,"images":0,"macros":1,"external_links":0,"defined_names":12,"comments":0,"pivot_tables":0},"unopened":[],"bounds":{"document_bytes":16777216,"sheet_cells":100000,"rows_first":2000,"rows_last":500,"rows_between":2000,"halvings":0,"cell_chars":16384,"cell_head_chars":4096},"cells_cut":0,"cells_raw":0,"read":"whole","date_system":"1900"}

{"sheet":"SVERWEIS","index":0,"n_rows":0,"n_cols":0,"rows_kept":0,"cut":false,"hidden":false,"merged":[]}

{"sheet":"Einführung","index":1,"n_rows":29,"n_cols":9,"rows_kept":29,"cut":false,"hidden":false,"merged":[[4,1,4,5]]}
[0]
[false]
[null,"Kindergeburtstag:"]
[]
[null,"Spaltenindex"]
[null,1,2,3,4,5]
[null,"Name Kind","Lieblingskuchen","Lieblingsessen","Lieblingsgetränk","Alter"]
[null,"Karla","Schokokuchen","Wiener Schnitzel","Erdbeermilch",7]
[null,"Mia","Mohrenkopfkuchen","Schaschlik","Wasser",4]
[null,"Maxi","Erdbeerkuchen","Spagetti","Milch",5]
[null,"Yvonne","Käsesahne","Spagetti","gelbe Limo",9]
[null,"Laura","Sahnetorte","Rindsroulade","weiße Limo",6]
[null,"Yannick","Schokotorte","Currywurst mit Pommes","Kindercola",8]
[null,"Leo","Himbereerkuchen","Pizza","Himbeersaft",8]
[null,"Maxi","Marmorkuchen","Pizza","Kakao",9]
[]
[]
[null,"Maxi doppelt Achtung !!! Bei S-Verweis"]
[]
[]
[]
[]
[]
[]
[null,"Suchkriterium",null,"Ausgabe"]
[null,"Maxi",null,null,null,null,null,null," "]
[]
[null,"Spaltenindex"]
[null,4]

{"sheet":"WENN-Beispiel","index":2,"n_rows":13,"n_cols":3,"rows_kept":13,"cut":false,"hidden":false,"merged":[]}
[]
[null,"Komplexes Beispiel Einkaufsrechnung : Rabatt -> ( Rechnungsbetrag; Stammkunde)"]
[]
[null,"Rechnungsbetrag",120]
[null,"Berechnung Endbetrag  nach Fall:",1]
[null,"Rabatt",{"$f":"VLOOKUP(C5,I17:J20,2,0)","v":{"$error":"#N/A"}}]
[null,"Endbetrag",{"$f":"C4-C4*C6","v":{"$error":"#N/A"}}]
[]
[null,"Szenario:"]
[null,"Beträgt der Rechnungsbetrag mindestens als 100 EURO und ist der Kunde Stammkunden, dann gibt es 8% Rabatt"]
[null,"Beträgt der Rechnungsbetrag mindestens als 100 EURO und ist der Kunde kein Stammkunden, dann gibt es 5% Rabatt"]
[null,"Beträgt der Rechnungsbetrag weniger als 100 EURO und ist der Kunde  Stammkunde, dann gibt es 3% Rabatt"]
[null,"Sonst gibt es keinen Rabatt"]

{"sheet":"WENN-Lösung","index":3,"n_rows":20,"n_cols":10,"rows_kept":20,"cut":false,"hidden":false,"merged":[]}
[]
[null,"Komplexes Beispiel Einkaufsrechnung : Rabatt -> ( Rechnungsbetrag; Stammkunde)"]
[]
[null,"Rechnungsbetrag",120]
[null,"Berechnung Endbetrag  nach Fall:",1]
[null,"Rabatt",{"$f":"VLOOKUP(C5,I17:J20,2,0)","v":0.08}]
[null,"Endbetrag",{"$f":"C4-C4*C6","v":110.4}]
[]
[null,"Szenario:"]
[null,"Beträgt der Rechnungsbetrag mindestens als 100 EURO und ist der Kunde Stammkunden, dann gibt es 8% Rabatt"]
[null,"Beträgt der Rechnungsbetrag mindestens als 100 EURO und ist der Kunde kein Stammkunden, dann gibt es 5% Rabatt"]
[null,"Beträgt der Rechnungsbetrag weniger als 100 EURO und ist der Kunde  Stammkunde, dann gibt es 3% Rabatt"]
[null,"Sonst gibt es keinen Rabatt"]
[]
[null,null,null,null,null,null,null,null,"Tabelle für SVERWEIS"]
[]
[null,null,null,null,null,null,null,null,1,0.08]
[null,null,null,null,null,null,null,null,2,0.05]
[null,null,null,null,null,null,null,null,3,0.03]
[null,null,null,null,null,null,null,null,4,0]

{"sheet":"Personen","index":4,"n_rows":1003,"n_cols":10,"rows_kept":1003,"cut":false,"hidden":false,"merged":[]}
["Spaltenindex"]
[1,2,3,4,5,6,7,8,9,10]
["PersonID","Anrede","Vorname","Nachname","Strasse","PLZ","Ort","Abteilung","Resturlaub","Vertretung"]
[2009,"Frau","Dorothee","Schröder","Dammstraße 49",68199,"Mannheim","Forschung",19,"Alt"]
[2010,"Frau","Ilona","Jansen","Innstraße 73",50735,"Köln","Außendienst",12,"Alt"]
[2011,"Frau","Dorothee","Benesch","Erzherzog-Johann-Straße 25",40210,"Düsseldorf","Außendienst",12,"Alt"]
[2012,"Frau","Helma","Groß","Bahnstraße 62",12105,"Berlin","Produktion",34,"Alt"]
[2013,"Frau","Mathilda","Bongartz","Elisabethstraße 7",38126,"Braunschweig","Logistik",28,"Alt"]
[2014,"Herr","Achim","Förster","Gutenbergstraße 52",39106,"Magdeburg","Controlling",25,"Alt"]
[2015,"Frau","Lea","Alt","Siemensstraße 66",38106,"Braunschweig","Logistik",25,"Alt"]
[2016,"Frau","Tabea","Schuhmacher","Kirchstraße 88",44267,"Dortmund","Außendienst",11,"Beck"]
[2017,"Herr","Frank","Meyer","Werkstraße 99",40235,"Düsseldorf","Außendienst",27,"Beck"]
[2018,"Herr","Julian","Schneider","Lärchenstraße 37",50935,"Köln","Außendienst",28,"Beck"]
[2019,"Frau","Vanessa","Jensen","Resselstraße 14",90427,"Nürnberg","Montage",18,"Beck"]
[2020,"Frau","Martina","Ohletz","Weingartenstraße 89",65189,"Wiesbaden","Buchhaltung",28,"Beck"]
[2021,"Herr","Marcus","Beckhaus","Schillerstraße 22",65199,"Wiesbaden","Buchhaltung",25,"Beck"]
[2022,"Frau","Ingrid","Bungart","Alte Straße 15",53225,"Bonn","Außendienst",13,"Beck"]
[2023,"Frau","Alexandra","Meister","Rosenstraße 58",22115,"Hamburg","Ausbildung",30,"Beck"]
[2024,"Herr","Gustaf","Kramer","Schulstraße 33",24148,"Kiel","Instandhaltung",14,"Beck"]
[2025,"Frau","Regina","Wagner","Mühlstraße 50",12349,"Berlin","Produktion",16,"Beck"]
[2026,"Herr","Achim","Klein","Ghegastraße 27",41238,"Mönchengladbach","Außendienst",20,"Beck"]
[2027,"Herr","Wolfgang","Maier","Raiffeisenstraße 6",12459,"Berlin","Produktion",15,"Beck"]
[2028,"Herr","Michael","Schröder","Elisabethstraße 84",48151,"Münster","Außendienst",18,"Beck"]
[2029,"Frau","Corinna","Urselmann","Anzengruberstraße 86",22083,"Hamburg","Ausbildung",34,"Beck"]
[2030,"Frau","Ricarda","Spielmann","Wiener Neustädter Straße 39",58089,"Hagen","Außendienst",20,"Beck"]
[2031,"Herr","Stefan","Groß","Dorfstraße 76",10709,"Berlin","Produktion",32,"Beck"]
[2032,"Frau","Katja","Urselmann","Fabrikstraße 101",20095,"Hamburg","Ausbildung",30,"Beckhaus"]
[2033,"Herr","Mike","Urselmann","Werkstraße 91",47839,"Krefeld","Außendienst",24,"Beckhaus"]
[2034,"Herr","Dirk","Wagner","Brückenstraße 40",30175,"Hannover","Logistik",30,"Beckhaus"]
[2035,"Frau","Martina","Bongartz","Wagnerstraße 32",28195,"Bremen","Wareneingang",17,"Beckhaus"]
[2036,"Herr","Eberhard","Weißmann","Roseggerstraße 48",80797,"München","Montage",10,"Beckhaus"]
[2037,"Frau","Kerstin","Neukirch","Tulpenstraße 45",33615,"Bielefeld","Außendienst",20,"Beckhaus"]
[2038,"Frau","Maja","Berger","Bahnstraße 51",12307,"Berlin","Produktion",20,"Beckhaus"]
[2039,"Frau","Margrit","Schuhmacher","Dr. Karl Renner-Straße 93",4109,"Leipzig","Marketing",24,"Beckhaus"]
[2040,"Frau","Gina","Urselmann","Roseggerstraße 49",45289,"Essen","Außendienst",26,"Beckhaus"]
[2041,"Frau","Verena","Fuhrmeister","Elisabethstraße 58",80803,"München","Montage",26,"Beckhaus"]
[2042,"Herr","Heinz","Köhler","Kindergartenstraße 78",90475,"Nürnberg","Montage",31,"Beckhaus"]
[2043,"Frau","Florence","Seidel","Bundesstraße 2",1129,"Dresden","Marketing",15,"Beckhaus"]
[2044,"Frau","Julia","Berger","Hanriederstraße 63",3053,"Cottbus","Vertrieb",13,"Beckhaus"]
[2045,"Herr","Dieter","Schmitz","Fadingerstraße 94",4289,"Leipzig","Marketing",24,"Benesch"]
[2046,"Frau","Esther","Groß","Rosenstraße 53",22119,"Hamburg","Ausbildung",16,"Berger"]
[2047,"Herr","Dirk","Herzog","Gartenstraße 64",48151,"Münster","Außendienst",28,"Berger"]
[2048,"Frau","Irene","Vosskamp","Quellenstraße 23",39116,"Magdeburg","Controlling",23,"Berger"]
[2049,"Frau","Michaela","Förster","Wagnerstraße 31",45889,"Gelsenkirchen","Außendienst",16,"Berger"]
[2050,"Frau","Beate","Groß","Industriestraße 101",58095,"Hagen","Außendienst",27,"Berger"]
[2051,"Frau","Barbara","Bongartz","Hochstraße 4",65189,"Wiesbaden","Buchhaltung",26,"Berger"]
[2052,"Frau","Louisa","Ohletz","Linzer Straße 54",68161,"Mannheim","Forschung",17,"Berger"]
[2053,"Frau","Regina","Berger","Lastenstraße 45",3042,"Cottbus","Vertrieb",12,"Berger"]
[2054,"Frau","Florence","Bergmann","Andreas-Hofer-Straße 93",23569,"Lübeck","Instandhaltung",19,"Berger"]
[2055,"Herr","Peter","Förster","Ghegastraße 36",22175,"Hamburg","Ausbildung",26,"Berger"]
[2056,"Frau","Verena","Bungart","Innstraße 48",42119,"Wuppertal","Außendienst",31,"Berger"]
[2057,"Frau","Theresa","Klein","Innsbrucker Straße 39",50858,"Köln","Außendienst",26,"Berger"]
[2058,"Herr","Achim","Jensen","Beethovenstraße 48",12355,"Berlin","Produktion",30,"Berger"]
[2059,"Frau","Helma","Dickmann","Burgenlandstraße 15",6116,"Halle","Controlling",21,"Berger"]
[2060,"Frau","Irene","Köhler","Flurstraße 19",39122,"Magdeburg","Controlling",20,"Berger"]
[2061,"Herr","David","Brinkmann","Seestraße 77",44793,"Bochum","Außendienst",19,"Berger"]
[2062,"Herr","Ingo","Schröder","Nelkenstraße 58",50996,"Köln","Außendienst",11,"Berger"]
[2063,"Herr","Bernd","Förster","Siedlerstraße 40",44369,"Dortmund","Außendienst",17,"Berger"]
[2064,"Frau","Maja","Ohletz","Fliederstraße 32",22299,"Hamburg","Ausbildung",30,"Berger"]
[2065,"Herr","Egon","Fuhrmeister","Donaustraße 12",68239,"Mannheim","Forschung",25,"Berger"]
[2066,"Frau","Petra","Fischer","Neubaustraße 35",12107,"Berlin","Produktion",14,"Berger"]
[2067,"Frau","Vanessa","Ohletz","Pestalozzistraße 16",80634,"München","Montage",18,"Berger"]
[2068,"Frau","Gina","Seidel","Linzer Straße 25",86156,"Augsburg","Montage",32,"Bergmann"]
[2069,"Herr","Alfred","Groß","Buchenstraße 81",45143,"Essen","Außendienst",15,"Bergmann"]
[2070,"Herr","Eberhard","Beckhaus","Seestraße 77",90403,"Nürnberg","Montage",15,"Bergmann"]
[2071,"Frau","Esther","Fuhrmeister","Roseggerstraße 8",48161,"Münster","Außendienst",12,"Bergmann"]
[2072,"Frau","Rebecca","Nickel","Landesstraße 24",22047,"Hamburg","Ausbildung",22,"Bergmann"]
[2073,"Frau","Miriam","Nickel","Negrellistraße 63",21031,"Hamburg","Ausbildung",27,"Bergmann"]
[2074,"Frau","Barbara","Seidel","Waldstraße 88",14059,"Berlin","Produktion",20,"Bergmann"]
[2075,"Frau","Corinna","Brinkmann","Kapellenstraße 88",48151,"Münster","Außendienst",12,"Bergmann"]
[2076,"Herr","Justus","Maier","Höhenstraße 3",18057,"Rostock","Produktion",12,"Bergmann"]
[2077,"Frau","Julia","Köhler","Stelzhamerstraße 38",99098,"Erfurt","Lohnabrechnung",24,"Bergmann"]
[2078,"Frau","Hilde","Schuhmacher","Kreuzstraße 78",90451,"Nürnberg","Montage",30,"Bergmann"]
[2079,"Frau","Theresa","Möller","Kirchenstraße 13",22119,"Hamburg","Ausbildung",32,"Bergmann"]
[2080,"Frau","Angela","Köhler","Haydnstraße 85",45896,"Gelsenkirchen","Außendienst",33,"Bergmann"]
[2081,"Frau","Roswitha","Bergmann","Grabenstraße 34",6108,"Halle","Controlling",26,"Bergmann"]
[2082,"Herr","Bernd","Mandel","Sportplatzstraße 11",1309,"Dresden","Marketing",14,"Bergmann"]
[2083,"Herr","Robert","Förster","Jahnstraße 19",40215,"Düsseldorf","Außendienst",21,"Bergmann"]
[2084,"Frau","Julia","Jung","Feldstraße 32",39114,"Magdeburg","Controlling",14,"Bergmann"]
[2085,"Herr","Mike","Schneider","Hubertusstraße 33",33659,"Bielefeld","Außendienst",26,"Bergmann"]
{"$rows_left_out":924}
{"sheet":"sogehts","index":5,"n_rows":34,"n_cols":3,"rows_kept":34,"cut":false,"hidden":true,"merged":[]}
[]
[]
[]
[]
[null,"Abteilung","Forschung"]
[]
[null,"Mitarbeiter",{"$f":"INDEX(Personen,1+_xlfn.AGGREGATE(15,6,ROW(A:A)/((Personen!$H$4:$H$1003)=$C$5),ROW(A1)),1)","v":2009}]
[null,null,{"$f":"INDEX(Personen,1+_xlfn.AGGREGATE(15,6,ROW(A:A)/((Personen!$H$4:$H$1003)=$C$5),ROW(A2)),1)","v":2052}]
[null,null,{"$f":"INDEX(Personen,1+_xlfn.AGGREGATE(15,6,ROW(A:A)/((Personen!$H$4:$H$1003)=$C$5),ROW(A3)),1)","v":2065}]
[null,null,{"$f":"INDEX(Personen,1+_xlfn.AGGREGATE(15,6,ROW(A:A)/((Personen!$H$4:$H$1003)=$C$5),ROW(A4)),1)","v":2117}]
[null,null,{"$f":"INDEX(Personen,1+_xlfn.AGGREGATE(15,6,ROW(A:A)/((Personen!$H$4:$H$1003)=$C$5),ROW(A5)),1)","v":2121}]
[null,null,{"$f":"INDEX(Personen,1+_xlfn.AGGREGATE(15,6,ROW(A:A)/((Personen!$H$4:$H$1003)=$C$5),ROW(A6)),1)","v":2129}]
[null,null,{"$f":"INDEX(Personen,1+_xlfn.AGGREGATE(15,6,ROW(A:A)/((Personen!$H$4:$H$1003)=$C$5),ROW(A7)),1)","v":2166}]
[null,null,{"$f":"INDEX(Personen,1+_xlfn.AGGREGATE(15,6,ROW(A:A)/((Personen!$H$4:$H$1003)=$C$5),ROW(A8)),1)","v":2189}]
[null,null,{"$f":"INDEX(Personen,1+_xlfn.AGGREGATE(15,6,ROW(A:A)/((Personen!$H$4:$H$1003)=$C$5),ROW(A9)),1)","v":2190}]
[null,null,{"$f":"INDEX(Personen,1+_xlfn.AGGREGATE(15,6,ROW(A:A)/((Personen!$H$4:$H$1003)=$C$5),ROW(A10)),1)","v":2231}]
[null,null,{"$f":"INDEX(Personen,1+_xlfn.AGGREGATE(15,6,ROW(A:A)/((Personen!$H$4:$H$1003)=$C$5),ROW(A11)),1)","v":2241}]
[null,null,{"$f":"INDEX(Personen,1+_xlfn.AGGREGATE(15,6,ROW(A:A)/((Personen!$H$4:$H$1003)=$C$5),ROW(A12)),1)","v":2261}]
[null,null,{"$f":"INDEX(Personen,1+_xlfn.AGGREGATE(15,6,ROW(A:A)/((Personen!$H$4:$H$1003)=$C$5),ROW(A13)),1)","v":2267}]
[null,null,{"$f":"INDEX(Personen,1+_xlfn.AGGREGATE(15,6,ROW(A:A)/((Personen!$H$4:$H$1003)=$C$5),ROW(A14)),1)","v":2268}]
[null,null,{"$f":"INDEX(Personen,1+_xlfn.AGGREGATE(15,6,ROW(A:A)/((Personen!$H$4:$H$1003)=$C$5),ROW(A15)),1)","v":2273}]
[null,null,{"$f":"INDEX(Personen,1+_xlfn.AGGREGATE(15,6,ROW(A:A)/((Personen!$H$4:$H$1003)=$C$5),ROW(A16)),1)","v":2303}]
[null,null,{"$f":"INDEX(Personen,1+_xlfn.AGGREGATE(15,6,ROW(A:A)/((Personen!$H$4:$H$1003)=$C$5),ROW(A17)),1)","v":2309}]
[null,null,{"$f":"INDEX(Personen,1+_xlfn.AGGREGATE(15,6,ROW(A:A)/((Personen!$H$4:$H$1003)=$C$5),ROW(A18)),1)","v":2324}]
[null,null,{"$f":"INDEX(Personen,1+_xlfn.AGGREGATE(15,6,ROW(A:A)/((Personen!$H$4:$H$1003)=$C$5),ROW(A19)),1)","v":2348}]
[null,null,{"$f":"INDEX(Personen,1+_xlfn.AGGREGATE(15,6,ROW(A:A)/((Personen!$H$4:$H$1003)=$C$5),ROW(A20)),1)","v":2359}]
[null,null,{"$f":"INDEX(Personen,1+_xlfn.AGGREGATE(15,6,ROW(A:A)/((Personen!$H$4:$H$1003)=$C$5),ROW(A21)),1)","v":2373}]
[null,null,{"$f":"INDEX(Personen,1+_xlfn.AGGREGATE(15,6,ROW(A:A)/((Personen!$H$4:$H$1003)=$C$5),ROW(A22)),1)","v":2374}]
[null,null,{"$f":"INDEX(Personen,1+_xlfn.AGGREGATE(15,6,ROW(A:A)/((Personen!$H$4:$H$1003)=$C$5),ROW(A23)),1)","v":2391}]
[null,null,{"$f":"INDEX(Personen,1+_xlfn.AGGREGATE(15,6,ROW(A:A)/((Personen!$H$4:$H$1003)=$C$5),ROW(A24)),1)","v":2398}]
[null,null,{"$f":"INDEX(Personen,1+_xlfn.AGGREGATE(15,6,ROW(A:A)/((Personen!$H$4:$H$1003)=$C$5),ROW(A25)),1)","v":2414}]
[null,null,{"$f":"INDEX(Personen,1+_xlfn.AGGREGATE(15,6,ROW(A:A)/((Personen!$H$4:$H$1003)=$C$5),ROW(A26)),1)","v":2444}]
[null,null,{"$f":"INDEX(Personen,1+_xlfn.AGGREGATE(15,6,ROW(A:A)/((Personen!$H$4:$H$1003)=$C$5),ROW(A27)),1)","v":2446}]
[null,null,{"$f":"INDEX(Personen,1+_xlfn.AGGREGATE(15,6,ROW(A:A)/((Personen!$H$4:$H$1003)=$C$5),ROW(A28)),1)","v":2469}]

{"sheet":"Urlaubsantrag","index":6,"n_rows":35,"n_cols":6,"rows_kept":35,"cut":false,"hidden":false,"merged":[[33,4,33,7]]}
[]
[null,"Urlaubsantrag"]
[]
[null,"Allgemeine Daten"]
[]
[null,"  Mitarbeiternr.:",null,2222]
[]
[null,"  Name:",null,{"$f":"VLOOKUP($D$6,Personen,4,0)","v":"Schuhmacher"}]
[]
[null,"  Vorname",null,{"$f":"VLOOKUP($D$6,Personen,3,0)","v":"Heike"}]
[]
[null,"  Abteilung:",null,{"$f":"VLOOKUP($D$6,Personen,8,0)","v":"Montage"}]
[]
[null,"  Vertretung:",null,{"$f":"VLOOKUP($D$6,Personen,10,0)","v":"Fuhrmeister"}]
[]
[]
[null,"Urlaubsdaten"]
[]
[null,"  Ich beantrage Urlaub "]
[null,null,"vom:","2020-06-01"]
[]
[null,null,"bis:","2020-06-03"]
[]
[null,"  Tage insgesamt",null,{"$f":"NETWORKDAYS(D20,D22,feiertage)","v":{"$error":"#REF!"}}]
[]
[null,"  verbleibender Urlaub",null,{"$f":"VLOOKUP(D6,Personen,9,0)-D24","v":{"$error":"#REF!"}},null,{"$f":"IF(D26<0,\"Eingabe ungültig\",\"\")","v":{"$error":"#REF!"}}]
[]
[]
[]
[]
[null,"Bewilligung",null,null,"Vorgesetzter:"]
[]
[null,"  Urlaub bewilligt:",null,"¨","………………………………………………………………"]
[null,null,null,null,"Herr Dr. Vollmer"]
[null,"  Urlaub abgelehnt:",null,"¨"]

{"sheet":"Datenbank","index":7,"n_rows":11,"n_cols":6,"rows_kept":11,"cut":false,"hidden":true,"merged":[]}
[]
["  Beantragter Urlaub"]
["Personal ID","Nachname","Beginn","Ende","Tage","Resturlaub"]
[]
[]
[2222,"Schuhmacher","2020-06-01","2020-06-03",2,29]
[2184,"Möller","2020-06-01","2020-06-03",2,19]
[2456,"Förster","2020-08-01","2020-08-07",5,21]
[2456,"Förster","2020-08-01","2020-08-07",5,21]
[3000,"Wagner","2020-08-01","2020-08-18",13,13]
[2056,"Bungart","2020-08-05","2020-08-18",9,22]

{"sheet":"Tabelle1","index":8,"n_rows":30,"n_cols":8,"rows_kept":30,"cut":false,"hidden":true,"merged":[]}
[]
[]
[]
[]
[null,"a"]
[]
[null,null,2222,"Schuhmacher","2017-06-01","2017-06-03",2,29]
[null,null,2222,"Schuhmacher","2017-06-01","2017-06-03",2,29]
[null,null,2222,"Schuhmacher","2017-06-01","2017-06-03",2,29]
[null,null,2222,"Schuhmacher","2017-06-01","2017-06-03",2,29]
[null,null,2222,"Schuhmacher","2017-06-01","2017-06-03",2,29]
[null,null,2222,"Schuhmacher","2017-06-01","2017-06-03",2,29]
[null,null,2222,"Schuhmacher","2017-06-01","2017-06-03",2,29]
[null,null,2222,"Schuhmacher","2017-06-01","2017-06-03",2,29]
[null,null,2222,"Schuhmacher","2017-06-01","2017-06-03",2,29]
[null,null,2222,"Schuhmacher","2017-06-01","2017-06-03",2,29]
[null,1,2222,"Schuhmacher","2017-06-01","2017-06-03",2,29]
[null,2]
[null,3]
[null,4]
[null,5]
[null,6]
[null,7]
[null,8]
[null,9]
[null,10]
[null,11]
[null,12]
[null,13]
[null,14]

{"sheet":"Artikel","index":9,"n_rows":53,"n_cols":5,"rows_kept":53,"cut":false,"hidden":true,"merged":[]}
[null,"Anzahl Artikel pro Kategorie"]
[null,"Kategorie","Anzahl"]
[null,"Süßigkeiten",{"$f":"COUNTIF(B6:B53,B3)","v":1}]
[]
["ID","Kategorie","Artikelname","Listenpreis","Liefereinheit"]
[85,"Backwaren & Backmischungen","Brownie Mix",12.49,"3 Kartons"]
[86,"Backwaren & Backmischungen","Cake Mix",15.99,"4 Kartons"]
[19,"Backwaren & Backmischungen","Chocolate Biscuits Mix",9.1999999999999993,"10 Kartons x 12 Stück"]
[21,"Backwaren & Backmischungen","Scones",10,"24 Packungen x 4 Stück"]
[83,"Chips, Snacks","Potato Chips",1.8]
[40,"Fleischkonserven","Crab Meat",18.399999999999999,"24 x 4-oz-Dosen"]
[96,"Fleischkonserven","Smoked Salmon",4,"5 oz"]
[95,"Fleischkonserven","Tuna Fish",2,"5 oz"]
[34,"Getränke","Beer",14,"24 x 12-oz-Flaschen"]
[1,"Getränke","Chai",18,"10 Kartons x 20 Beutel"]
[43,"Getränke","Coffee",46,"16 x 500-g-Dosen"]
[81,"Getränke","Green Tea",2.99,"20 Beutel pro Karton"]
[87,"Getränke","Tea",4,"100 Stück pro Karton"]
[52,"Getreide","Long Grain Rice",7,"16 x 2-kg-Kartons"]
[82,"Getreideprodukte","Granola",4]
[97,"Getreideprodukte","Hot Cereal",5]
[4,"Gewürze","Cajun Seasoning",22,"48 x 6-oz-Gläser"]
[77,"Gewürze","Mustard",13,"12 Kartons"]
[3,"Gewürze","Syrup",10,"12 x 550-ml-Flaschen"]
[6,"Marmelade, Konfitüre","Boysenberry Spread",25,"12 x 8-oz-Gläser"]
[20,"Marmelade, Konfitüre","Marmalade",81,"30 Geschenkpackungen"]
[72,"Milchprodukte","Mozzarella",34.799999999999997,"24 x 200-g-Packungen"]
[102,"Molkerei","Butter",2.7]
[56,"Nudeln","Gnocchi",38,"24 x 250-g-Packungen"]
[57,"Nudeln","Ravioli",19.5,"24 x 250-g-Packungen"]
[91,"Obst- & Gemüsekonserven","Cherry Pie Filling",2,"15,25 oz"]
[93,"Obst- & Gemüsekonserven","Corn",1.2,"14,5 oz"]
[17,"Obst- & Gemüsekonserven","Fruit Cocktail",39,"15,25 oz"]
[92,"Obst- & Gemüsekonserven","Green Beans",1.2,"14,5 oz"]
[89,"Obst- & Gemüsekonserven","Peaches",1.5,"15,25 oz"]
[88,"Obst- & Gemüsekonserven","Pears",1.3,"15,25 oz"]
[94,"Obst- & Gemüsekonserven","Peas",1.5,"14,5 oz"]
[90,"Obst- & Gemüsekonserven","Pineapple",1.8,"15,25 oz"]
[5,"Öl","Olive Oil",21.35,"36 Kartons"]
[8,"Saucen","Curry Sauce",40,"12 x 12-oz-Gläser"]
[65,"Saucen","Hot Pepper Sauce",21.05,"32 x 8-oz-Flaschen"]
[66,"Saucen","Tomato Sauce",17,"24 x 8-oz-Gläser"]
[99,"Suppen","Chicken Soup",1.95]
[100,"Suppen","Chinese Sweetsour Soup",2.5]
[41,"Suppen","Clam Chowder",9.65,"12 x 12-oz-Dosen"]
[101,"Suppen","Linsen Soup",3.5]
[98,"Suppen","Vegetable Soup",1.89]
[48,"Süßigkeiten","Chocolate",12.75,"10 Packungen"]
[74,"Trockenfrüchte & Nüsse","Almonds",10,"5-kg-Packungen"]
[51,"Trockenfrüchte & Nüsse","Dried Apples",53,"50 x 300-g-Packungen"]
[7,"Trockenfrüchte & Nüsse","Dried Pears",30,"12 x 1-lb-Packungen"]
[80,"Trockenfrüchte & Nüsse","Dried Plums",3.5,"1-lb-Beutel"]
[14,"Trockenfrüchte & Nüsse","Walnuts",23.25,"40 x 100-g-Packungen"]

{"sheet":"Abfrage","index":10,"n_rows":11,"n_cols":9,"rows_kept":11,"cut":false,"hidden":true,"merged":[]}
["PersonId"]
[2009]
[]
[null,null,null,null,null,null,null,null,"Problem beim \"Rüberziehen von Matrizen\""]
[null,null,null,null,"Vorname",{"$f":"VLOOKUP(Abfrage!$A$2,Personen!A4:H1003,3,FALSE)","v":"Dorothee"},null,null,"Wie wird Datenüberprüfungsfeld wieder gelöscht ???"]
[null,null,null,null,"Name",{"$f":"VLOOKUP(Abfrage!$A$2,Personen!A4:H1004,4,FALSE)","v":"Schröder"},null,null,"(button \"Alle löschen\")"]
[null,null,null,null,"Straße",{"$f":"VLOOKUP(Abfrage!$A$2,Personen!A6:H1005,5,FALSE)","v":{"$error":"#N/A"}}]
[null,null,null,null,"PLZ",{"$f":"VLOOKUP(Abfrage!$A$2,Personen!A7:H1006,6,FALSE)","v":{"$error":"#N/A"}},null,null,"Tipp: Liste markieren Strg + Shift + pfeil unten"]
[null,null,null,null,null,null,null,null,"vorher ganze obere Zeile markieren"]
[]
[null,null,null,null,null,null,null,null,"häufiger Fehler beim \"Runterziehen\" Matrix verändert sich wert 2009 eingeben !!!"]

{"sheet":"SVERWEIS TRUE","index":11,"n_rows":11,"n_cols":7,"rows_kept":11,"cut":false,"hidden":false,"merged":[]}
[]
[null,"Berechnungen mit Hilfe der Funktion SVERWEIS"]
[]
[]
[]
[null,null,null,null,null,"Gramm","Preis"]
[null,null,null,null,null,0,0.8]
["Berechnung der Portokosten eines Briefs",null,null,null,"ab",20,0.95]
[null,null,null,null,"ab",50,1.55]
["Briefgewicht in Gramm:",null,"Gramm",null,"ab",500,2.7]
["Porto:",{"$f":"VLOOKUP(B10,F7:G11,2,TRUE)","v":0.8},null,null,"ab",1000,"kein Brief mehr"]

{"sheet":"IHK Notenschlüssel","index":12,"n_rows":82,"n_cols":7,"rows_kept":82,"cut":false,"hidden":false,"merged":[[28,4,28,5],[12,4,12,5],[15,4,15,5],[18,4,18,5],[21,4,21,5],[24,4,24,5],[27,4,27,5],[13,4,13,5],[16,4,16,5],[19,4,19,5],[22,4,22,5],[25,4,25,5]]}
[]
[null,null,null,null,"Prozent","Note","Bewertung"]
["IHK-Notenschlüssel",null,null,null,18,{"$f":"VLOOKUP(E3,A6:B82,2,TRUE)","v":5.7},{"$f":"VLOOKUP(E3,E6:F11,2,1)","v":"ungenügend"}]
[]
["Prozent","Note",null,null,"Punkte","Bewertung"]
[0,6,null,null,0,"ungenügend"]
[6,5.9,null,null,30,"mangelhaft"]
[12,5.8,null,null,50,"ausreichend"]
[17,5.7,null,null,67,"befriedigend"]
[23,5.6,null,null,81,"gut"]
[29,5.5,null,null,92,"sehr gut"]
[30,5.4]
[31,5.4,null,null,"100-92 Prozent"]
[32,5.3,null,null," = Sehr Gut"]
[33,5.3]
[34,5.2,null,null,"91-81 Prozent"]
[35,5.2,null,null," = Gut"]
[36,5.0999999999999996]
[37,5.0999999999999996,null,null,"80-67 Prozent"]
[38,5,null,null," = Befriedigend"]
[39,5]
[40,5,null,null,"66-50 Prozent"]
[41,4.9000000000000004,null,null," = Ausreichend"]
[42,4.9000000000000004]
[43,4.8,null,null,"49-30 Prozent"]
[44,4.8,null,null," = Mangelhaft"]
[45,4.7]
[46,4.7,null,null,"29-0 Prozent"]
[47,4.5999999999999996,null,null," = Ungenügend"]
[48,4.5999999999999996]
[49,4.5]
[50,4.4000000000000004]
[51,4.4000000000000004]
[52,4.3]
[53,4.3]
[54,4.2]
[55,4.0999999999999996]
[56,4.0999999999999996]
[57,4]
[58,4]
[59,3.9]
[60,3.9]
[61,3.8]
[62,3.7]
[63,3.7]
[64,3.6]
[65,3.6]
[66,3.5]
[67,3.4]
[68,3.3]
[69,3.3]
[70,3.2]
[71,3.1]
[72,3.1]
[73,3]
[74,2.9]
[75,2.9]
[76,2.8]
[77,2.7]
[78,2.7]
[79,2.6]
[80,2.5]
[81,2.4]
[82,2.2999999999999998]
[83,2.2000000000000002]
[84,2.1]
[85,2]
[86,2]
[87,1.9]
[88,1.8]
[89,1.7]
[90,1.6]
[91,1.5]
[92,1.4]
[93,1.4]
[94,1.3]
[95,1.3]
[96,1.2]
[97,1.2]
[98,1.1000000000000001]
{"$rows_left_out":3}
{"sheet":"Chefliste","index":13,"n_rows":6,"n_cols":1,"rows_kept":6,"cut":false,"hidden":false,"merged":[]}
[]
["Vorgesetzte"]
["Herr Dr. Häusl"]
["Frau Dipl.-Ing. Wiese"]
["Herr Dr. Vollmer"]
["Frau Fuchs"]

{"sheet":"Liste Feiertage","index":14,"n_rows":14,"n_cols":2,"rows_kept":14,"cut":false,"hidden":false,"merged":[]}
["Datum","Feiertage Bayern 2020"]
["2020-01-01","Neujahr"]
["2020-01-06","Heilige Drei Könige"]
["2020-04-10","Karfreitag"]
["2020-04-13","Ostermontag"]
["2020-05-01","Maifeiertag"]
["2020-05-21","Christi Himmelfahrt"]
["2020-06-01","Pfingstmontag"]
["2020-06-11","Fronleichnam"]
["2020-08-15","Mariä Himmelfahrt"]
["2020-10-03","Tag der Deutschen Einheit"]
["2020-11-01","Allerheiligen"]
["2020-12-25","1. Weihnachtstag"]
["2020-12-26","2. Weihnachtstag"]

{"sheet":"Makros","index":15,"n_rows":0,"n_cols":0,"rows_kept":0,"cut":false,"hidden":true,"merged":[]}